{"text_format":"3","workbook":"xlsx","n_sheets":6,"sheets":["1. Unternehmensdaten","1. Kalkulation","1. Übersicht LZ_NLZ","1. Österreichische Werte","1. KV Daten DFG 2018","1. Statistische Daten"],"not_rendered":{"images":2,"macros":1,"defined_names":38,"comments":3},"read":"whole","date_system":"1900"}

{"sheet":"1. Unternehmensdaten","index":0,"n_rows":85,"n_cols":4,"rows_kept":85}
["Eingabeblatt für Unternehmensdaten"]
[]
["Name des Unternehmens"]
[]
["Unternehmensstandort"]
[]
["Art des Unternehmens"]
[]
["Gesamt-Umsatz in EUR/Jahr"]
[]
["Anzahl Mitarbeiter gesamt",null,"Anzahl"]
["davon Mitarbeiter > 25 Jahre im Unternehmen (6 Wochen Urlaub)",null,"Anzahl"]
["Anzahl der Mitarbeiter > 25 Jahre im Unternehmen in %",{"$f":"IF(ISERROR(B12/B11),\"\",B12/B11)","v":""},"in %"]
["Unternehmensindividueller %-Aufschlag für NLZ",{"$f":"IF(ISERROR('1. Übersicht LZ_NLZ'!F28*(1-'1. Unternehmensdaten'!B13)+'1. Übersicht LZ_NLZ'!H28*'1. Unternehmensdaten'!B13),\"\",'1. Übersicht LZ_NLZ'!F28*(1-'1. Unternehmensdaten'!B13)+'1. Übersicht LZ_NLZ'!H28*'1. Unternehmensdaten'!B13)","v":""}]
[]
["Anzahl Mitarbeiter in Abfertigung ALT",null,"Anzahl"]
["Individueller % Aufschlag für Abfertigungsvorsorge",{"$f":"IF(ISERROR((B16/B11)*'1. Österreichische Werte'!F63+(('1. Unternehmensdaten'!B11-'1. Unternehmensdaten'!B16)/'1. Unternehmensdaten'!B11)*1.53%),\"\",(B16/B11)*'1. Österreichische Werte'!F63+(('1. Unternehmensdaten'!B11-'1. Unternehmensdaten'!B16)/'1. Unternehmensdaten'!B11)*1.53%)","v":""}]
[]
["Feiertage","langjähriger Durchschnitt"]
[]
["Kostenstruktur (Kosten jeweils PRO JAHR)"]
["Aufwendungen für Material und sonstige bezogene Leistungen"]
["Materialkosten",null,{"$f":"IF(ISERROR(B23/$B$32),\"Lohnsumme fehlt!\",B23/$B$32)","v":"Lohnsumme fehlt!"}]
["Maschinen & Geräte (inkl. AFA, Reparaturaufwand, GeWiGü)",null,{"$f":"IF(ISERROR(B24/$B$32),\"Lohnsumme fehlt!\",B24/$B$32)","v":"Lohnsumme fehlt!"}]
[]
["Präventivdienste (SFK, AM)",null,null,{"$f":"IF(ISBLANK(B26),\"\",IF(AND(B11>=50,B26<('1. Österreichische Werte'!G39/2)),\"ACHTUNG: Wert überprüfen!\",IF(AND(B11<50,B26<('1. Österreichische Werte'!G39/4)),\"ACHTUNG: Wert überprüfen!\",\"\")))","v":""}]
["Kosten für Persönliche Schutzausrüstung (PSA)"]
["Kosten für Arbeitskleidung"]
["Kosten für Arbeitnehmerschutz (SFK, AM, PSA) in % von Bruttolohn",{"$f":"IF(OR(B26=0,B26=\"\"),IF(B11>=50,'1. Österreichische Werte'!G39,'1. Österreichische Werte'!G39/2),B26)+B27+B28","v":0},{"$f":"IF(ISERROR(B29/B32),\"Lohnsumme fehlt!\",B29/B32)","v":"Lohnsumme fehlt!"}]
[]
{"$rows_left_out":56}
{"sheet":"1. Kalkulation","index":1,"n_rows":96,"n_cols":14,"rows_kept":96}
["Kalkulation für Stundenverrechnungssätze für Denkmal-, Fassaden- und Gebäudereiniger",{"$nulls":4},"EUR/Std pro Lohngruppe"]
[{"$nulls":5},"LG1","LG2","LG3","LG4","LG5","LG6","Freie LV",null,"LV = Lohnvereinbarung"]
["A","Kollektivlohn",null,null,{"v":1,"d":"100.00%"},{"$f":"'1. KV Daten DFG 2018'!C2","v":{"v":10.6,"d":"€ 10.60"}},{"$f":"'1. KV Daten DFG 2018'!C3","v":{"v":9.62,"d":"€ 9.62"}},{"$f":"'1. KV Daten DFG 2018'!C4","v":{"v":9.39,"d":"€ 9.39"}},{"$f":"'1. KV Daten DFG 2018'!C5","v":{"v":9.11,"d":"€ 9.11"}},{"$f":"'1. KV Daten DFG 2018'!C6","v":{"v":8.77,"d":"€ 8.77"}},{"$f":"'1. KV Daten DFG 2018'!C7","v":{"v":8.68,"d":"€ 8.68"}}]
["B","Nebenkosten für Nichtanwesenheitszeiten\nFeiertage, Urlaub, Krankenentgelt, sonstige Verhinderungen",null,null,{"$f":"IF(ISBLANK('1. Unternehmensdaten'!B12),'1. Übersicht LZ_NLZ'!F35,'1. Unternehmensdaten'!B14)","v":{"v":0.23872010114603223,"d":"23.87%"}},{"$f":"F3*$E$4","v":{"v":2.5304330721479418,"d":"€ 2.53"}},{"v":2.29648737302483,"d":"€ 2.30"},{"v":2.241581749761243,"d":"€ 2.24"},{"v":2.1747401214403537,"d":"€ 2.17"},{"v":2.0935752870507027,"d":"€ 2.09"},{"v":2.0720904779475595,"d":"€ 2.07"},0]
[]
[null,null,"Summe Pos. B",null,{"$f":"SUM(E4:E4)","v":{"v":0.23872010114603223,"d":"23.87%"}},{"v":2.5304330721479418,"d":"€ 2.53"},{"v":2.29648737302483,"d":"€ 2.30"},{"v":2.241581749761243,"d":"€ 2.24"},{"v":2.1747401214403537,"d":"€ 2.17"},{"v":2.0935752870507027,"d":"€ 2.09"},{"v":2.0720904779475595,"d":"€ 2.07"},0]
[]
["C","Sozialversicherungsabgaben und sonstige Sozialabgaben von A und B"]
[null,"Pensionsversicherung",null,{"$f":"'1. Österreichische Werte'!B76","v":{"v":0.1255,"d":"12.55%"}}]
[null,"Unfallversicherung",null,{"$f":"'1. Österreichische Werte'!B77","v":{"v":0.013,"d":"1.30%"}}]
[null,"Krankenversicherung",null,{"$f":"'1. Österreichische Werte'!B78","v":{"v":0.0378,"d":"3.78%"}}]
[null,"Arbeitslosenversicherung und IESG Zuschlag",null,{"$f":"'1. Österreichische Werte'!B79+'1. Österreichische Werte'!B80","v":{"v":0.0335,"d":"3.35%"}}]
[null,"Wohnbauförderung",null,{"$f":"'1. Österreichische Werte'!B81","v":{"v":0.005,"d":"0.50%"}}]
[null,"Sozialversicherungsbeiträge gesamt",null,{"$f":"SUM(D9:D13)","v":{"v":0.21480000000000002,"d":"21.48%"}}]
[null,"Dienstgeberbeitrag (DB) Familienlastenausgleichsfonds",null,{"$f":"'1. Österreichische Werte'!B83","v":{"v":0.039,"d":"3.90%"}}]
[null,"Dienstgeberzuschlag (DZ)",null,{"$f":"VLOOKUP('1. Unternehmensdaten'!B5,dezet,2,1)","v":{"$error":"#N/A"}}]
[null,"Kommunalsteuer",null,{"$f":"'1. Österreichische Werte'!B85","v":{"v":0.03,"d":"3.00%"}}]
[null,"Summe Pos. C",null,{"$f":"SUM(D14:D17)","v":{"$error":"#N/A"}}]
[{"$f":"D18","v":{"$error":"#N/A"}},"von Summe A + B",null,null,{"$f":"F19/$F$3","v":{"$error":"#N/A"}},{"$f":"(F3+F6)*$A$19","v":{"$error":"#N/A"}},{"$error":"#N/A"},{"$error":"#N/A"},{"$error":"#N/A"},{"$error":"#N/A"},{"$error":"#N/A"},{"$error":"#N/A"}]
[]
[null,null,"Summe Pos. B + C",null,{"$f":"SUM(E6:E20)","v":{"$error":"#N/A"}},{"$f":"F3*$E$21","v":{"$error":"#N/A"}},{"$error":"#N/A"},{"$error":"#N/A"},{"$error":"#N/A"},{"$error":"#N/A"},{"$error":"#N/A"},{"$error":"#N/A"}]
[]
["D","Sonderzahlungen"]
[null,"Weihnachtsremuneration (WR)",null,{"$f":"1/12","v":{"v":0.08333333333333333,"d":"8.33%"}}]
[null,"Urlaubszuschuss (UZ) ",null,{"$f":"1/12","v":{"v":0.08333333333333333,"d":"8.33%"}}]
[{"$nulls":3},{"$f":"SUM(D24:D25)","v":{"v":0.16666666666666666,"d":"16.67%"}}]
[{"$f":"D26","v":{"v":0.16666666666666666,"d":"16.67%"}},"von Summe A + B",null,null,{"$f":"F27/$F$3","v":{"v":0.20645335019100536,"d":"20.65%"}},{"$f":"(F3+F4)*$A$27","v":{"v":2.188405512024657,"d":"€ 2.19"}},{"v":1.9860812288374714,"d":"€ 1.99"},{"v":1.9385969582935405,"d":"€ 1.94"},{"v":1.880790020240059,"d":"€ 1.88"},{"v":1.810595881175117,"d":"€ 1.81"},{"v":1.7920150796579266,"d":"€ 1.79"},0]
[]
[null,null,"Summe Pos. B + C + D",null,{"$f":"SUM(E21:E28)","v":{"$error":"#N/A"}},{"$f":"F3*$E$29","v":{"$error":"#N/A"}},{"$error":"#N/A"},{"$error":"#N/A"},{"$error":"#N/A"},{"$error":"#N/A"},{"$error":"#N/A"},{"$error":"#N/A"}]
[]
{"$rows_left_out":67}
{"sheet":"1. Übersicht LZ_NLZ","index":2,"n_rows":69,"n_cols":8,"rows_kept":69,"merged":[[0,1,0,2],[1,1,1,2],[2,1,2,2],[3,1,3,2],[4,1,4,2],[6,1,6,7],[8,1,8,3],[8,4,8,7],[9,1,9,3],[9,4,9,5],[9,6,9,7],[10,1,10,2],[11,1,11,2],[12,1,12,2],[13,1,13,2],[14,1,14,2],[15,1,15,2],[16,1,16,2],[17,1,17,2],[18,1,18,2],[19,1,21,2],[23,1,23,2],[23,4,23,5],[23,6,23,7],[25,1,25,3],[25,4,25,7],[26,1,26,3],[26,4,26,5],[26,6,26,7],[27,1,29,2],[31,1,32,3],[31,4,31,7],[32,4,32,5],[32,6,32,7],[33,1,33,2],[34,1,34,2],[35,1,35,3],[40,1,40,3]]}
[null,"Ausgangsdaten",null,"Kal.Tage/Jahr","Kal.Tage/Wo","Arb.Zeit/Wo","Arb.Tage/Wo","Std./AT"]
[null,"52 volle Wochen plus Rumpfwoche",null,365,7,40,5,8]
[null,"Schalttag jedes 4. Jahr (Ø 1/4 Kdtg)",null,0.25]
[{"$nulls":4},"Wo/Jahr","Std/Jahr","Std./Mo","Arb.Tage/Jahr"]
[null,"Vertragliche Brutto - Jahresarbeitszeit",null,{"$f":"SUM(D2:D4)","v":365.25},{"$f":"D5/E2","v":{"v":52.17857142857143,"d":"52.18"}},{"$f":"E5*F2","v":{"v":2087.1428571428573,"d":"2,087.14"}},{"$f":"H5*H2/12","v":{"v":173.92857142857144,"d":"173.93"}},{"$f":"E5*G2","v":{"v":260.89285714285717,"d":"260.89"}}]
[]
[null,"LOHNNEBENKOSTENBERECHNUNG"]
[]
[null,"Ermittlung der Ø Anwesenheitszeit / Jahr",null,null,"Arbeiter"]
[null,"Urlaubsdauer in Wochen",null,null,"5 Wochen",null,"6 Wochen"]
[null,"1. Ø Vertragliche Brutto-Jahresarbeitszeit",null,"AT",{"$f":"H5","v":{"v":260.89285714285717,"d":"260.89"}},null,{"$f":"E11","v":{"v":260.89285714285717,"d":"260.89"}}]
[null,"2. 15 gesetzliche Feiertage ",null,"AT",{"$f":"VLOOKUP('1. Unternehmensdaten'!$B$19,Feiertage2,2,0)","v":{"v":10.464,"d":"10.46"}},{"$f":"E12/E20","v":{"v":0.04968310470567806,"d":"4.97%"}},{"$f":"E12","v":{"v":10.464,"d":"10.46"}},{"$f":"G12/G20","v":{"v":0.05089126411098697,"d":"5.09%"}}]
[null,"2a. Zusätzl. arbeitsfreie Tage gem. KV",null,"AT",{"$f":"VLOOKUP('1. Unternehmensdaten'!$B$19,Feiertage2,3,0)","v":{"v":0.714,"d":"0.71"}},{"$f":"E13/E20","v":{"v":3.3900742316374365E-3,"d":"0.34%"}},{"$f":"E13","v":{"v":0.714,"d":"0.71"}},{"$f":"G13/G20","v":{"v":3.4725117139950967E-3,"d":"0.35%"}}]
[null,"3. Vertragliche Netto-Jahresarbeitszeit (1-2-2a)",null,"AT",{"$f":"E11-E12-E13","v":{"v":249.71485714285717,"d":"249.71"}},null,{"$f":"E14","v":{"v":249.71485714285717,"d":"249.71"}}]
[null,"4. Urlaub",null,"AT",{"v":25,"d":"25.00"},{"$f":"E15/E20","v":{"v":0.1187000781385657,"d":"11.87%"}},{"v":30,"d":"30.00"},{"$f":"G15/G20","v":{"v":0.14590385352920576,"d":"14.59%"}}]
[null,"5. Soll-Arbeitszeit / Jahr (3-4)",null,"AT",{"$f":"E14-E15","v":{"v":224.71485714285717,"d":"224.71"}},null,{"$f":"G14-G15","v":{"v":219.71485714285717,"d":"219.71"}}]
[null,"6. Krankenstand ",null,"AT",{"$f":"IF(IF(ISERROR(IF(ISBLANK('1. Unternehmensdaten'!B36),ROUNDUP('1. Unternehmensdaten'!B34,0),'1. Unternehmensdaten'!B36)),'1. Statistische Daten'!B8,IF(ISBLANK('1. Unternehmensdaten'!B36),ROUNDUP('1. Unternehmensdaten'!B34,0),'1. Unternehmensdaten'!B36))=0,'1. Statistische Daten'!B8,IF(ISERROR(IF(ISBLANK('1. Unternehmensdaten'!B36),ROUNDUP('1. Unternehmensdaten'!B34,0),'1. Unternehmensdaten'!B36)),'1. Statistische Daten'!B8,IF(ISBLANK('1. Unternehmensdaten'!B36),ROUNDUP('1. Unternehmensdaten'!B34,0),'1. Unternehmensdaten'!B36)))","v":{"v":12.6,"d":"12.60"}},{"$f":"E17/E20","v":{"v":0.059824839381837115,"d":"5.98%"}},{"$f":"E17","v":{"v":12.6,"d":"12.60"}},{"$f":"G17/G20","v":{"v":0.061279618482266415,"d":"6.13%"}}]
[null,"7. Sonstige Verhinderungszeiten ",null,"AT",{"$f":"IF(ISERROR('1. Unternehmensdaten'!B37),'1. Statistische Daten'!B9,IF(ISBLANK('1. Unternehmensdaten'!B37),'1. Statistische Daten'!B9,IF('1. Unternehmensdaten'!B37=0,'1. Statistische Daten'!B9,'1. Unternehmensdaten'!B37)))","v":{"v":1.5,"d":"1.50"}},{"$f":"E18/E20","v":{"v":0.007122004688313943,"d":"0.71%"}},{"$f":"E18","v":{"v":1.5,"d":"1.50"}},{"$f":"G18/G20","v":{"v":0.007295192676460288,"d":"0.73%"}}]
[null,"7a. Sonstige Fehlzeiten (Berufsschulzeit - Lehrlinge, Ausbildungen, …)",null,"AT",{"$f":"IF(ISERROR('1. Unternehmensdaten'!B38),0,IF(ISBLANK('1. Unternehmensdaten'!B38),0,IF('1. Unternehmensdaten'!B38=0,0,'1. Unternehmensdaten'!B38)))","v":{"v":0,"d":"0.00"}},{"$f":"E19/E20","v":{"v":0,"d":"0.00%"}},{"$f":"E19","v":{"v":0,"d":"0.00"}},{"$f":"G19/G20","v":{"v":0,"d":"0.00%"}}]
[null,"8. Anwesenheitszeit/Jahr (5-6-7-7a), Leistungszeit",null,"AT",{"$f":"E16-E17-E18-E19","v":{"v":210.61485714285718,"d":"210.61"}},{"v":1,"d":"100.00%"},{"$f":"G16-G17-G18-G19","v":{"v":205.61485714285718,"d":"205.61"}},{"v":1,"d":"100.00%"}]
[{"$nulls":3},"oder Std.",{"$f":"E20*H2","v":{"v":1684.9188571428574,"d":"1,684.92"}},null,{"$f":"G20*H2","v":{"v":1644.9188571428574,"d":"1,644.92"}}]
[{"$nulls":3},"oder Wo",{"$f":"E21/F2","v":{"v":42.12297142857143,"d":"42.12"}},null,{"$f":"G21/F2","v":{"v":41.12297142857143,"d":"41.12"}}]
[]
[null,"Ø Anwesenheitszeit im Jahr pro Woche",null,"Std.",{"$f":"E21/E5","v":{"v":32.29139493497605,"d":"32.29"}},null,{"$f":"G21/E5","v":{"v":31.524796714579058,"d":"31.52"}}]
[]
[null,"Nichtanwesenheitszeiten / Jahr",null,null,"Arbeiter"]
[null,"Urlaubsdauer in Wochen",null,null,"5 Wochen",null,"6 Wochen"]
[null,"9. Summe Nichtanwesenheits-Zeiten/Jahr (2+2a+4+6+7+7a), Fehlzeiten, Ausfallzeiten",null,"AT",{"$f":"E11-E20","v":{"v":50.27799999999999,"d":"50.28"}},{"$f":"E28/E20","v":{"v":0.23872010114603223,"d":"23.87%"}},{"$f":"G11-G20","v":{"v":55.27799999999999,"d":"55.28"}},{"$f":"G28/G20","v":{"v":0.2688424405129145,"d":"26.88%"}}]
[{"$nulls":3},"oder Std.",{"$f":"E28*8","v":{"v":402.22399999999993,"d":"402.22"}},null,{"$f":"G28*8","v":{"v":442.22399999999993,"d":"442.22"}}]
[{"$nulls":3},"oder Wo",{"$f":"E29/40","v":{"v":10.055599999999998,"d":"10.06"}},null,{"$f":"G29/40","v":{"v":11.055599999999998,"d":"11.06"}}]
{"$rows_left_out":40}
{"sheet":"1. Österreichische Werte","index":3,"n_rows":89,"n_cols":33,"rows_kept":89}
["Werte Behindertenausgleichstaxe"]
["Quelle:","https://www.weka.at/personalverrechnung/News/Ausgleichstaxe-2018"]
["Quelle & Definition:","https://www.sozialministeriumservice.at/site/Menschen_mit_Behinderung/Ausbildung_Beruf_und_Beschaeftigung/Ausgleichstaxe_und_Praemie/Ausgleichstaxe_und_Praemie"]
[]
["Jahr 2018","Anzahl MA","EUR/nebP/Mon","EUR/nebP/Jahr",null,"nebP = nicht eingestellte begünstigte Person",{"$nulls":3},"Jahr 2017","Anzahl MA","EUR/nebP/Mon","EUR/nebP/Jahr","Steigerung 2018",null,"Jahr 2016","Anzahl MA","EUR/nebP/Mon","EUR/nebP/Jahr","Steigerung 2017",null,"Jahr 2015","Anzahl MA","EUR/nebP/Mon","EUR/nebP/Jahr","Steigerung 2016",null,"Jahr 2014","Anzahl MA","EUR/nebP/Mon","EUR/nebP/Jahr","Steigerung 2015"]
["weniger",100,{"v":257,"d":"€ 257.00"},{"$f":"C6*12","v":{"v":3084,"d":"€ 3,084.00"}},{"$nulls":5},"weniger",100,{"v":253,"d":"€ 253.00"},{"$f":"L6*12","v":{"v":3036,"d":"€ 3,036.00"}},{"$f":"C6/L6-1","v":{"v":0.015810276679841806,"d":"1.58%"}},null,"weniger",100,{"v":251,"d":"€ 251.00"},{"$f":"R6*12","v":{"v":3012,"d":"€ 3,012.00"}},{"$f":"L6/R6-1","v":{"v":0.007968127490039834,"d":"0.80%"}},null,"weniger",100,{"v":248,"d":"€ 248.00"},{"$f":"X6*12","v":{"v":2976,"d":"€ 2,976.00"}},{"$f":"R6/X6-1","v":{"v":0.012096774193548487,"d":"1.21%"}},null,"weniger",100,{"v":244,"d":"€ 244.00"},{"$f":"AD6*12","v":{"v":2928,"d":"€ 2,928.00"}},{"$f":"X6/AD6-1","v":{"v":0.016393442622950838,"d":"1.64%"}},{"v":0.0163934426229508,"d":"1.64%"}]
["100 bis",399,{"v":361,"d":"€ 361.00"},{"$f":"C7*12","v":{"v":4332,"d":"€ 4,332.00"}},"Wert für Kalk",{"$f":"IF('1. Unternehmensdaten'!B11<100,'1. Österreichische Werte'!D6,IF('1. Unternehmensdaten'!B11<399,'1. Österreichische Werte'!D7,'1. Österreichische Werte'!D8))","v":{"v":3084,"d":"€ 3,084.00"}},{"$nulls":3},"100 bis",399,{"v":355,"d":"€ 355.00"},{"$f":"L7*12","v":{"v":4260,"d":"€ 4,260.00"}},{"$f":"C7/L7-1","v":{"v":0.016901408450704203,"d":"1.69%"}},null,"100 bis",399,{"v":352,"d":"€ 352.00"},{"$f":"R7*12","v":{"v":4224,"d":"€ 4,224.00"}},{"$f":"L7/R7-1","v":{"v":0.008522727272727293,"d":"0.85%"}},null,"100 bis",399,{"v":348,"d":"€ 348.00"},{"$f":"X7*12","v":{"v":4176,"d":"€ 4,176.00"}},{"$f":"R7/X7-1","v":{"v":0.011494252873563315,"d":"1.15%"}},null,"100 bis",399,{"v":342,"d":"€ 342.00"},{"$f":"AD7*12","v":{"v":4104,"d":"€ 4,104.00"}},{"$f":"X7/AD7-1","v":{"v":0.01754385964912286,"d":"1.75%"}},{"v":0.01754385964912286,"d":"1.75%"}]
["mehr als",400,{"v":383,"d":"€ 383.00"},{"$f":"C8*12","v":{"v":4596,"d":"€ 4,596.00"}},{"$nulls":5},"mehr als",400,{"v":377,"d":"€ 377.00"},{"$f":"L8*12","v":{"v":4524,"d":"€ 4,524.00"}},{"$f":"C8/L8-1","v":{"v":0.01591511936339529,"d":"1.59%"}},null,"mehr als",400,{"v":374,"d":"€ 374.00"},{"$f":"R8*12","v":{"v":4488,"d":"€ 4,488.00"}},{"$f":"L8/R8-1","v":{"v":0.008021390374331583,"d":"0.80%"}},null,"mehr als",400,{"v":370,"d":"€ 370.00"},{"$f":"X8*12","v":{"v":4440,"d":"€ 4,440.00"}},{"$f":"R8/X8-1","v":{"v":0.0108108108108107,"d":"1.08%"}},null,"mehr als",400,{"v":364,"d":"€ 364.00"},{"$f":"AD8*12","v":{"v":4368,"d":"€ 4,368.00"}},{"$f":"X8/AD8-1","v":{"v":0.016483516483516425,"d":"1.65%"}},{"v":0.016483516483516425,"d":"1.65%"}]
[]
["Werte Dienstgeberzuschlag"]
["Definition:","https://www.wko.at/service/steuern/Zuschlag_zum_Dienstgeberbeitrag.html"]
[]
["Bundesland","Höhe DZ 2018","DZ",null,"Werte 2015","DZ"]
["Burgenland",{"v":0.0044,"d":"0.44%"},"(keine Änderung zu 2017)",null,"Burgenland",{"v":0.0044,"d":"0.44%"}]
["Kärnten",{"v":0.0041,"d":"0.41%"},null,null,"Kärnten",{"v":0.0041,"d":"0.41%"}]
["Niederösterreich",{"v":0.004,"d":"0.40%"},null,null,"Niederösterreich",{"v":0.004,"d":"0.40%"}]
["Oberösterreich",{"v":0.0036,"d":"0.36%"},null,null,"Oberösterreich",{"v":0.0036,"d":"0.36%"}]
["Salzburg",{"v":0.0042,"d":"0.42%"},null,null,"Salzburg",{"v":0.0042,"d":"0.42%"}]
["Steiermark",{"v":0.0039,"d":"0.39%"},null,null,"Steiermark",{"v":0.0039,"d":"0.39%"}]
["Tirol",{"v":4.3E-3,"d":"0.43%"},null,null,"Tirol",{"v":4.3E-3,"d":"0.43%"}]
["Vorarlberg",{"v":0.0039,"d":"0.39%"},null,null,"Vorarlberg",{"v":0.0039,"d":"0.39%"}]
["Wien",{"v":0.004,"d":"0.40%"},null,null,"Wien",{"v":0.004,"d":"0.40%"}]
[]
[]
["Werte U-Bahnsteuer/Wien 2018 (Wert seit 01.06.2012)"]
[null,"pro Woche","Wo/Mon","pro Monat","pro Jahr"]
["pro Mitarbeiter",{"v":2,"d":"€ 2.00"},4.35,{"$f":"B27*C27","v":{"v":8.7,"d":"€ 8.70"}},{"$f":"D27*12","v":{"v":104.39999999999999,"d":"€ 104.40"}},null,"zahlbar für MA bis 55 Jahre und nicht bei GFB"]
[]
["Definition und Quelle: ","https://www.wko.at/service/steuern/DGA_-_Dienstgeberabgabe_der_Gemeinde_Wien_(U-Bahn_Steuer)_.html "]
["Präventivdienste (Arbeitsmediziner, SFK)",{"$nulls":10},"es fehlt","Werte für Pärventivdienste"]
{"$rows_left_out":60}
{"sheet":"1. KV Daten DFG 2018","index":4,"n_rows":12,"n_cols":8,"rows_kept":12}
["Lohngruppe","Bezeichnung","Bruttostundensatz",2018,2017]
[1,"Facharbeiter",{"v":10.6,"d":"€ 10.60"},null,{"v":10.33,"d":"€ 10.33"},{"$f":"C2/E2-1","v":{"v":0.02613746369796699,"d":"2.61%"}},null,"Bruttostundensätze (Lohngruppen)"]
[2,"Sonderreiniger",{"v":9.62,"d":"€ 9.62"},null,{"v":9.36,"d":"€ 9.36"},{"v":0.02777777777777768,"d":"2.78%"},null,"Zuschläge (Üst., Nacht, SEG, Infektion, FT/SO)"]
[3,"Hotelreinigung",{"v":9.39,"d":"€ 9.39"},null,{"v":9.14,"d":"€ 9.14"},{"v":0.027352297592997843,"d":"2.74%"},null,"Trennungszulage, Zehrgeld"]
[4,"Hausbetreuer",{"v":9.11,"d":"€ 9.11"},null,{"v":8.87,"d":"€ 8.87"},{"v":0.027057497181510737,"d":"2.71%"},null,"Fahrtkostenentschädigung"]
[5,"UHR Krankenhaus/Pflegeheim ",{"v":8.77,"d":"€ 8.77"},null,{"v":8.54,"d":"€ 8.54"},{"v":0.02693208430913363,"d":"2.69%"}]
[6,"UHR (Büro, Industrie, …)",{"v":8.68,"d":"€ 8.68"},null,{"v":8.49,"d":"€ 8.49"},{"v":0.022379269729092988,"d":"2.24%"}]
[]
[null,"Zehrgeld pro Tag",{"v":10.3,"d":"€ 10.30"},null,{"v":10.1,"d":"€ 10.10"},{"$f":"C9/E9-1","v":{"v":0.01980198019801982,"d":"1.98%"}}]
[null,"Trennungszulage pro Tag",{"v":17.3,"d":"€ 17.30"},null,{"v":16.9,"d":"€ 16.90"},{"$f":"C10/E10-1","v":{"v":0.02366863905325456,"d":"2.37%"}}]
[]
[{"$nulls":5},{"$f":"AVERAGE(F2:F7)","v":{"v":0.026272731714746644,"d":"2.63%"}},null,"Erhöhung im Durchschnitt über die Lohngruppen"]

{"sheet":"1. Statistische Daten","index":5,"n_rows":79,"n_cols":15,"rows_kept":79}
["Feiertage"]
[null,"15 gesetzliche Feiertage ","Zusätzl. arbeitsfreie Tage gem. KV","Gesamt"]
["langjähriger Durchschnitt",{"v":10.464,"d":"10.46"},{"v":0.714,"d":"0.71"},{"$f":"SUM(B3:C3)","v":{"v":11.178,"d":"11.18"}},null,"Quelle: https://www.wko.at/branchen/stmk/gewerbe-handwerk/chemische-gewerbe-denkmal-fassade-gebaeudereiniger/Lohnnebenkosten_DFG_Reiniger_Stmk_2018.pdf"]
["laufendes Jahr (2018)",11.04,{"v":1,"d":"1.00"},{"$f":"SUM(B4:C4)","v":12.04},null,"Quelle: http://brückentage.info/2018/feiertage-oesterreich-2018.html und https://www.wko.at/Content.Node/branchen/oe/Chemische-Gewerbe-und-der-Denkmal-Fassaden-und-Gebaeudereiniger/Denkmal---Fassaden--und-Gebaeuderein/Lohnnebenkosten-Steiermark.pdf"]
[]
[]
["Durchschnittswerte Stand: 2018",{"$nulls":4},"Unterschiedliche Werte veröffentlicht (Gesamtösterreich, Arbeiter, Angestellte, …)"]
["Krankenstand (Arbeiter)",12.6,null,"Risiko",{"v":0.015,"d":"1.50%"},"Quelle: https://www.wko.at/branchen/stmk/gewerbe-handwerk/chemische-gewerbe-denkmal-fassade-gebaeudereiniger/Lohnnebenkosten_DFG_Reiniger_Stmk_2018.pdf"]
["Sonstige Verhinderungszeiten ",1.5,null,"Gewinn",{"v":0.05,"d":"5%"}]
[]
[]
[]
["Studie KMU-Forschung Austria - Beispielhafte Musterstundensatzkalkulation"]
[]
[null,"EPU Wien","17 Beschäftigte","70 Beschäftigte","250 Beschäftigte","510 Beschäftigte"]
["Umsatz",{"v":35000,"d":"35,000.00"}]
["Kostenstruktur"]
["Materialaufwand",{"v":2100,"d":"2,100.00"},{"v":29600,"d":"29,600.00"},{"v":219500,"d":"219,500.00"},{"v":348410,"d":"348,410.00"},{"v":417000,"d":"417,000.00"}]
["Materialaufwand in %",{"$f":"B18/B$28","v":{"v":0.06025824964131994,"d":"6.03%"}},{"$f":"C18/C$28","v":{"v":0.04023980750146141,"d":"4.02%"}},{"$f":"D18/D$28","v":{"v":0.07974365774530712,"d":"7.97%"}},{"$f":"E18/E$28","v":{"v":0.03972915619016994,"d":"3.97%"}},{"$f":"F18/F$28","v":{"v":0.02294658343531815,"d":"2.29%"}}]
["Fremdleistungen",{"v":2740,"d":"2,740.00"},{"v":85900,"d":"85,900.00"},{"v":131760,"d":"131,760.00"},{"v":594410,"d":"594,410.00"},{"v":1336300,"d":"1,336,300.00"}]
["Fremdleistungen in %",{"$f":"B20/B$28","v":{"v":0.07862266857962698,"d":"7.86%"}},{"$f":"C20/C$28","v":{"v":0.11677700893160592,"d":"11.68%"}},{"$f":"D20/D$28","v":{"v":0.047867992457957476,"d":"4.79%"}},{"$f":"E20/E$28","v":{"v":0.06778051069429383,"d":"6.78%"}},{"$f":"F20/F$28","v":{"v":0.07353361977126054,"d":"7.35%"}}]
["Personalkosten",{"v":20340,"d":"20,340.00"},{"v":456650,"d":"456,650.00"},{"v":1884400,"d":"1,884,400.00"},{"v":6584790,"d":"6,584,790.00"},{"v":13693400,"d":"13,693,400.00"},{"$f":"788704/F22","v":{"v":0.05759738268070749,"d":"0.0575973826807075"}}]
["Personalkosten in %",{"$f":"B22/B$28","v":{"v":0.5836441893830703,"d":"58.36%"}},{"$f":"C22/C$28","v":{"v":0.6207941924169714,"d":"62.08%"}},{"$f":"D22/D$28","v":{"v":0.684596577017115,"d":"68.46%"}},{"$f":"E22/E$28","v":{"v":0.7508629212406909,"d":"75.09%"}},{"$f":"F22/F$28","v":{"v":0.7535173755711884,"d":"75.35%"}}]
["Sonstiger Aufwand",{"v":9240,"d":"9,240.00"},{"v":152800,"d":"152,800.00"},{"v":483060,"d":"483,060.00"},{"v":1164970,"d":"1,164,970.00"},{"v":2623370,"d":"2,623,370.00"}]
["Sonstiger Aufwand in %",{"$f":"B24/B$28","v":{"v":0.26513629842180775,"d":"26.51%"}},{"$f":"C24/C$28","v":{"v":0.20772441169673322,"d":"20.77%"}},{"$f":"D24/D$28","v":{"v":0.17549417453507085,"d":"17.55%"}},{"$f":"E24/E$28","v":{"v":0.13284140836044395,"d":"13.28%"}},{"$f":"F24/F$28","v":{"v":0.144358222030481,"d":"14.44%"}}]
["Finanzierungskosten",{"v":430,"d":"430.00"},{"v":10640,"d":"10,640.00"},{"v":33850,"d":"33,850.00"},{"v":77050,"d":"77,050.00"},{"v":102570,"d":"102,570.00"}]
["Finanzierungskosten",{"$f":"B26/B$28","v":{"v":0.012338593974175036,"d":"1.23%"}},{"$f":"C26/C$28","v":{"v":0.014464579453228021,"d":"1.45%"}},{"$f":"D26/D$28","v":{"v":0.012297598244549639,"d":"1.23%"}},{"$f":"E26/E$28","v":{"v":0.008786003514401406,"d":"0.88%"}},{"$f":"F26/F$28","v":{"v":0.005644199191751996,"d":"0.56%"}}]
["Summe Kosten",{"$f":"B18+B20+B22+B24+B26","v":{"v":34850,"d":"34,850.00"}},{"v":735590,"d":"735,590.00"},{"v":2752570,"d":"2,752,570.00"},{"v":8769630,"d":"8,769,630.00"},{"v":18172640,"d":"18,172,640.00"}]
["Summe Kosten in %",{"v":1,"d":"100.0%"},{"v":0.9999999999999999,"d":"100.0%"},{"v":1,"d":"100.0%"},{"v":1,"d":"100.0%"},{"v":1,"d":"100.0%"}]
["Kosten in EUR",{"v":34850,"d":"34,850.00"},{"$f":"C28","v":{"v":735590,"d":"735,590.00"}},{"$f":"D28","v":{"v":2752570,"d":"2,752,570.00"}},{"$f":"E28","v":{"v":8769630,"d":"8,769,630.00"}},{"$f":"F28","v":{"v":18172640,"d":"18,172,640.00"}}]
{"$rows_left_out":49}